{"text_format":"3","workbook":"xlsx","n_sheets":7,"sheets":["PV poziomo","Rąbek_kalzip","KalZip_Rąbek","Dachówka_blachodachówka","Dachówka","Blachodachowka","Cennik"],"not_rendered":{"images":34,"external_links":2,"defined_names":24},"read":"whole","date_system":"1900"}

{"sheet":"PV poziomo","index":0,"n_rows":110,"n_cols":27,"rows_kept":110,"hidden":true,"merged":[[0,5,0,7],[0,9,0,12],[4,7,7,17],[9,3,9,5],[9,9,9,10],[11,1,15,1],[11,2,12,9],[14,3,14,6],[14,7,14,8],[16,3,17,6],[16,8,17,8],[16,9,17,9],[23,3,23,4],[24,3,24,4],[25,3,25,4],[26,3,26,4],[27,3,27,4],[28,3,28,4],[29,3,29,4],[30,3,30,4],[31,3,31,4],[32,3,32,4],[33,3,33,4],[34,3,34,4],[35,3,35,4],[36,3,36,4],[37,3,37,4],[52,16,56,16],[65,3,66,5],[74,3,74,5],[74,9,74,10],[74,14,74,15],[75,3,75,5],[75,9,75,10],[75,14,75,15],[76,3,76,5],[76,9,76,10],[76,14,76,15],[77,3,77,5],[77,9,77,10],[77,14,77,15],[78,9,78,10],[78,14,78,15],[79,9,79,10],[79,14,79,15],[80,9,80,10],[80,14,80,15],[81,9,81,10],[81,14,81,15],[82,9,82,10],[82,14,82,15],[83,9,83,10],[83,14,83,15],[84,9,84,10],[84,14,84,15],[85,9,85,10],[85,14,85,15],[86,3,86,5],[86,9,86,10],[86,14,86,15],[87,9,87,10],[87,14,87,15],[88,9,88,10],[88,14,88,15],[90,13,90,15],[92,13,92,15],[93,13,93,15],[94,13,94,15]]}
[{"$nulls":5},{"$f":"\"Moc generatora PV : \"&G93&\" kWp\"","v":"Moc generatora PV : 9,86 kWp"},{"$nulls":3},{"$f":"\"Dane klienta : \" &L10","v":"Dane klienta : Imie i Nazwisko"}]
{"$rows_empty":8}
[{"$nulls":3},"Data wykonania symulacji  : ",null,null,{"$f":"TODAY()","v":"2023-06-19"},null,null,"Dane klienta : ",null,"Imie i Nazwisko"]
[]
[null,"Strona 1","Dane wejściowe do symulacji - ułożenie pionowe modułów"]
[]
[]
[{"$nulls":3},"Pokrycie dachu",{"$nulls":3},"Dachówka",null,"▼"]
[]
[{"$nulls":3},"Rozstaw krokwi",{"$nulls":4},80,"  cm"]
[]
[]
[]
[]
[{"$nulls":3},"Rząd modułów PV",null,null,"Ilość modułów w rzędzie"]
{"$rows_left_out":78}
{"sheet":"Rąbek_kalzip","index":1,"n_rows":52,"n_cols":14,"rows_kept":52,"hidden":true}
[]
[null,"Rozstaw krokwii:",{"$f":"Dachówka_blachodachówka!I17","v":805},"cm","Szerokość PV",{"$f":"VLOOKUP($B$26,Cennik!F5:J8,5,FALSE)+0.02","v":1.153},"m"]
[]
[null,"Rzędy","Ilość modułów ","Klemy środkowe ","Klemy końcowe",{"$f":"Cennik!F59","v":"Profil nośny modułu Solo light 4,4m"},{"$f":"Cennik!F52","v":"Łącznik profili Solo5 "},{"$f":"B32","v":"Hak dachowy Rapid2+ Max"},{"$f":"B33","v":"Podkładka uniwesalna 2,5/5 mm pod haki dachowe (100 szt)"},{"$f":"B34","v":"Wkręty do drewna VA8x120mm 50St"},{"$f":"B35","v":"Zaślepka plastikowa Profi05 20St."},{"$f":"B38","v":"Zacisk odgromowy  8 i 10mm"},"Zestaw mocujący do pokryć falistych 10 x 200","Nasadka KlickTop"]
[null,"Rząd 1",{"$f":"KalZip_Rąbek!G27","v":1},{"$f":"IF(Rąbek_kalzip!$C5>0,((C5-1)*2),0)","v":0},{"$f":"IF(Rąbek_kalzip!$C5>0,4,0)","v":4},{"$f":"(CEILING(((Rąbek_kalzip!$C5*$F$2)/4.3),1))*2","v":2},{"$f":"(IF((Rąbek_kalzip!$F5>2),((CEILING((Rąbek_kalzip!$C5*$F$2/4.2),1))-1),0))*2","v":0},{"$f":"IF(C5=0,0,ROUNDUP(C5/($C$2/100),0)*2)","v":2},{"$f":"+H5*4","v":8},{"$f":"+H5*2","v":4},{"$f":"+E5","v":4},{"$f":"IF(Rąbek_kalzip!$C5>0,2,0)","v":2},{"$f":"IF(C5=0,0,ROUNDUP(C5/($C$2/100),0)*2)","v":2},{"$f":"M5","v":2}]
[null,"Rząd 2",{"$f":"KalZip_Rąbek!G28","v":2},{"$f":"IF(Rąbek_kalzip!$C6>0,((C6-1)*2),0)","v":2},{"$f":"IF(Rąbek_kalzip!$C6>0,4,0)","v":4},{"$f":"(CEILING(((Rąbek_kalzip!$C6*$F$2)/4.3),1))*2","v":2},{"$f":"(IF((Rąbek_kalzip!$F6>2),((CEILING((Rąbek_kalzip!$C6*$F$2/4.2),1))-1),0))*2","v":0},2,{"$f":"+H6*4","v":8},4,4,{"$f":"IF(Rąbek_kalzip!$C6>0,2,0)","v":2},2,2]
[null,"Rząd 3",{"$f":"KalZip_Rąbek!G29","v":3},{"$f":"IF(Rąbek_kalzip!$C7>0,((C7-1)*2),0)","v":4},{"$f":"IF(Rąbek_kalzip!$C7>0,4,0)","v":4},{"$f":"(CEILING(((Rąbek_kalzip!$C7*$F$2)/4.3),1))*2","v":2},{"$f":"(IF((Rąbek_kalzip!$F7>2),((CEILING((Rąbek_kalzip!$C7*$F$2/4.2),1))-1),0))*2","v":0},2,8,4,4,{"$f":"IF(Rąbek_kalzip!$C7>0,2,0)","v":2},2,2]
[null,"Rząd 4",{"$f":"KalZip_Rąbek!G30","v":4},{"$f":"IF(Rąbek_kalzip!$C8>0,((C8-1)*2),0)","v":6},{"$f":"IF(Rąbek_kalzip!$C8>0,4,0)","v":4},{"$f":"(CEILING(((Rąbek_kalzip!$C8*$F$2)/4.3),1))*2","v":4},{"$f":"(IF((Rąbek_kalzip!$F8>2),((CEILING((Rąbek_kalzip!$C8*$F$2/4.2),1))-1),0))*2","v":2},2,8,4,4,{"$f":"IF(Rąbek_kalzip!$C8>0,2,0)","v":2},2,2]
[null,"Rząd 5",{"$f":"KalZip_Rąbek!G31","v":5},{"$f":"IF(Rąbek_kalzip!$C9>0,((C9-1)*2),0)","v":8},{"$f":"IF(Rąbek_kalzip!$C9>0,4,0)","v":4},{"$f":"(CEILING(((Rąbek_kalzip!$C9*$F$2)/4.3),1))*2","v":4},{"$f":"(IF((Rąbek_kalzip!$F9>2),((CEILING((Rąbek_kalzip!$C9*$F$2/4.2),1))-1),0))*2","v":2},2,8,4,4,{"$f":"IF(Rąbek_kalzip!$C9>0,2,0)","v":2},2,2]
[null,"Rząd 6",{"$f":"KalZip_Rąbek!G32","v":0},{"$f":"IF(Rąbek_kalzip!$C10>0,((C10-1)*2),0)","v":0},{"$f":"IF(Rąbek_kalzip!$C10>0,4,0)","v":0},{"$f":"(CEILING(((Rąbek_kalzip!$C10*$F$2)/4.3),1))*2","v":0},{"$f":"(IF((Rąbek_kalzip!$F10>2),((CEILING((Rąbek_kalzip!$C10*$F$2/4.2),1))-1),0))*2","v":0},0,0,0,0,{"$f":"IF(Rąbek_kalzip!$C10>0,2,0)","v":0},0,0]
[null,"Rząd 7",{"$f":"KalZip_Rąbek!G33","v":0},{"$f":"IF(Rąbek_kalzip!$C11>0,((C11-1)*2),0)","v":0},{"$f":"IF(Rąbek_kalzip!$C11>0,4,0)","v":0},{"$f":"(CEILING(((Rąbek_kalzip!$C11*$F$2)/4.3),1))*2","v":0},{"$f":"(IF((Rąbek_kalzip!$F11>2),((CEILING((Rąbek_kalzip!$C11*$F$2/4.2),1))-1),0))*2","v":0},0,0,0,0,{"$f":"IF(Rąbek_kalzip!$C11>0,2,0)","v":0},0,0]
[null,"Rząd 8",{"$f":"KalZip_Rąbek!G34","v":0},{"$f":"IF(Rąbek_kalzip!$C12>0,((C12-1)*2),0)","v":0},{"$f":"IF(Rąbek_kalzip!$C12>0,4,0)","v":0},{"$f":"(CEILING(((Rąbek_kalzip!$C12*$F$2)/4.3),1))*2","v":0},{"$f":"(IF((Rąbek_kalzip!$F12>2),((CEILING((Rąbek_kalzip!$C12*$F$2/4.2),1))-1),0))*2","v":0},0,0,0,0,{"$f":"IF(Rąbek_kalzip!$C12>0,2,0)","v":0},0,0]
[null,"Rząd 9",{"$f":"KalZip_Rąbek!G35","v":0},{"$f":"IF(Rąbek_kalzip!$C13>0,((C13-1)*2),0)","v":0},{"$f":"IF(Rąbek_kalzip!$C13>0,4,0)","v":0},{"$f":"(CEILING(((Rąbek_kalzip!$C13*$F$2)/4.3),1))*2","v":0},{"$f":"(IF((Rąbek_kalzip!$F13>2),((CEILING((Rąbek_kalzip!$C13*$F$2/4.2),1))-1),0))*2","v":0},0,0,0,0,{"$f":"IF(Rąbek_kalzip!$C13>0,2,0)","v":0},0,0]
[null,"Rząd 10",{"$f":"KalZip_Rąbek!G36","v":0},{"$f":"IF(Rąbek_kalzip!$C14>0,((C14-1)*2),0)","v":0},{"$f":"IF(Rąbek_kalzip!$C14>0,4,0)","v":0},{"$f":"(CEILING(((Rąbek_kalzip!$C14*$F$2)/4.3),1))*2","v":0},{"$f":"(IF((Rąbek_kalzip!$F14>2),((CEILING((Rąbek_kalzip!$C14*$F$2/4.2),1))-1),0))*2","v":0},0,0,0,0,{"$f":"IF(Rąbek_kalzip!$C14>0,2,0)","v":0},0,0]
[null,"Rząd 11",{"$f":"KalZip_Rąbek!G37","v":0},{"$f":"IF(Rąbek_kalzip!$C15>0,((C15-1)*2),0)","v":0},{"$f":"IF(Rąbek_kalzip!$C15>0,4,0)","v":0},{"$f":"(CEILING(((Rąbek_kalzip!$C15*$F$2)/4.3),1))*2","v":0},{"$f":"(IF((Rąbek_kalzip!$F15>2),((CEILING((Rąbek_kalzip!$C15*$F$2/4.2),1))-1),0))*2","v":0},0,0,0,0,{"$f":"IF(Rąbek_kalzip!$C15>0,2,0)","v":0},0,0]
{"$rows_left_out":38}
{"sheet":"KalZip_Rąbek","index":2,"n_rows":140,"n_cols":27,"rows_kept":140,"hidden":true,"merged":[[0,5,0,7],[0,9,0,12],[4,7,7,17],[9,3,9,5],[9,9,9,10],[11,1,15,1],[11,2,12,9],[14,3,14,6],[14,7,14,8],[22,3,22,4],[22,10,22,11],[26,3,26,4],[27,3,27,4],[28,3,28,4],[29,3,29,4],[30,3,30,4],[31,3,31,4],[32,3,32,4],[33,3,33,4],[34,3,34,4],[35,3,35,4],[36,3,36,4],[37,3,37,4],[38,3,38,4],[39,3,39,4],[40,3,40,4],[41,3,41,4],[42,3,42,4],[43,3,43,4],[44,3,44,4],[45,3,45,4],[46,3,46,4],[50,3,50,5],[53,3,53,5],[62,3,62,5],[63,16,67,16],[74,3,75,5],[80,3,80,5],[83,3,83,5],[87,5,87,7],[91,1,95,1],[93,3,93,5],[94,3,94,5],[95,3,95,5],[95,14,95,15],[96,3,96,5],[96,14,96,15],[97,14,97,15],[98,14,98,15],[99,14,99,15],[100,14,100,15],[101,14,101,15],[102,14,102,15],[103,14,103,15],[104,14,104,15],[105,3,105,5],[105,14,105,15],[106,14,106,15],[107,3,107,5],[107,14,107,15],[108,14,108,15],[109,14,109,15],[110,14,110,15],[111,3,111,5],[111,14,111,15],[112,3,112,5],[113,14,113,15],[114,14,114,15],[117,14,117,15],[118,14,118,15],[119,13,119,15],[120,13,120,15],[121,13,121,15],[126,1,132,1]]}
[{"$nulls":5},{"$f":"\"Moc generatora PV : \"&G118&\" kWp\"","v":{"$error":"#N/A"}},{"$nulls":3},{"$f":"\"Dane klienta : \" &L10","v":"Dane klienta : Imie i Nazwisko"},{"$nulls":6},{"$f":"TODAY()","v":"2023-06-19"}]
{"$rows_empty":8}
[{"$nulls":3},"Data wykonania symulacji  : ",null,null,{"$f":"TODAY()","v":"2023-06-19"},null,null,"Dane klienta : ",null,"Imie i Nazwisko"]
[]
[null,"Strona 1","Dane wejściowe do symulacji - ułożenie pionowe modułów"]
[]
[{"$nulls":19},"KalZip"]
[{"$nulls":3},"Pokrycie dachu",{"$nulls":3},"Rąbek",null,"▼",{"$nulls":9},"Rąbek"]
{"$rows_empty":7}
[{"$nulls":3},"KalZip",{"$nulls":6},"Rąbek"]
[]
[{"$nulls":3},"Rząd modułów PV",null,null,"Ilość modułów w rzędzie"]
[]
[{"$nulls":3},1,null,null,1,"  sztuk"]
[{"$nulls":3},2,null,null,2,"  sztuk"]
{"$rows_left_out":113}
{"sheet":"Dachówka_blachodachówka","index":3,"n_rows":139,"n_cols":27,"rows_kept":139,"merged":[[0,5,0,7],[0,9,0,12],[4,7,7,17],[9,3,9,5],[9,9,9,10],[11,1,15,1],[11,2,12,9],[14,3,14,6],[14,7,14,8],[16,3,17,6],[16,8,17,8],[16,9,17,9],[23,3,23,4],[24,3,24,4],[25,3,25,4],[26,3,26,4],[27,3,27,4],[28,3,28,4],[29,3,29,4],[30,3,30,4],[31,3,31,4],[32,3,32,4],[33,3,33,4],[34,3,34,4],[35,3,35,4],[36,3,36,4],[37,3,37,4],[38,3,38,4],[39,3,39,4],[40,3,40,4],[41,3,41,4],[42,3,42,4],[43,3,43,4],[47,3,47,5],[50,3,50,5],[58,16,62,16],[59,3,59,5],[71,3,72,5],[76,3,77,5],[80,3,80,5],[84,5,84,7],[84,9,84,12],[86,1,90,1],[86,2,87,9],[90,3,90,5],[90,9,90,10],[90,14,90,15],[91,3,91,5],[91,9,91,10],[91,14,91,15],[92,3,92,5],[92,9,92,10],[92,14,92,15],[93,3,93,5],[93,9,93,10],[93,14,93,15],[94,9,94,10],[94,14,94,15],[95,9,95,10],[95,14,95,15],[96,9,96,10],[96,14,96,15],[97,9,97,10],[97,14,97,15],[98,9,98,10],[98,14,98,15],[99,3,99,5],[99,9,99,10],[99,14,99,15],[100,3,100,5],[100,9,100,10],[100,14,100,15],[101,9,101,10],[101,14,101,15],[102,3,103,5],[103,9,103,10],[103,14,103,15],[104,3,104,5],[104,9,104,10],[104,14,104,15],[105,9,105,10],[105,14,105,15],[107,9,107,10],[107,14,107,15],[108,9,108,10],[108,14,108,15],[109,9,109,10],[109,14,109,15],[111,3,111,5],[111,9,111,10],[111,14,111,15],[112,3,112,5],[113,3,113,5],[113,9,113,10],[113,14,113,15],[116,14,116,15],[117,14,117,15],[118,13,118,15],[119,13,119,15],[120,13,120,15],[121,14,121,15],[122,14,122,15],[123,14,123,15],[125,1,131,1],[125,9,130,17]]}
[{"$nulls":5},{"$f":"\"Moc generatora PV : \"&G119&\" kWp\"","v":"Moc generatora PV : 11,745 kWp"},{"$nulls":3},{"$f":"\"Dane klienta : \" &L10","v":"Dane klienta : jak"},{"$nulls":6},{"$f":"TODAY()","v":"2023-06-19"}]
{"$rows_empty":8}
[{"$nulls":3},"Data wykonania symulacji  : ",null,null,{"$f":"TODAY()","v":"2023-06-19"},null,null,"Dane klienta : ",null,"jak"]
[]
[null,"Strona 1","Dane wejściowe do symulacji - ułożenie pionowe modułów"]
[]
[]
[{"$nulls":3},"Pokrycie dachu",{"$nulls":3},"Blachodachówka",null,"▼"]
[]
[{"$nulls":3},"Rozstaw krokwi",{"$nulls":4},805,"  cm"]
[]
[]
[]
[]
[{"$nulls":3},"Rząd modułów PV",null,null,"Ilość modułów w rzędzie"]
{"$rows_left_out":118}
{"sheet":"Dachówka","index":4,"n_rows":53,"n_cols":14,"rows_kept":53,"hidden":true}
[]
[null,"Rozstaw krokwii:",{"$f":"Dachówka_blachodachówka!I17","v":805},"cm","Szerokość PV",{"$f":"VLOOKUP($B$26,Cennik!F5:J8,5,FALSE)+0.02","v":1.153},"m"]
[]
[null,"Rzędy","Ilość modułów ","Klemy środkowe ","Klemy końcowe",{"$f":"Cennik!F59","v":"Profil nośny modułu Solo light 4,4m"},{"$f":"Cennik!F52","v":"Łącznik profili Solo5 "},{"$f":"B32","v":"Hak dachowy Rapid2+ Max"},{"$f":"B33","v":"Podkładka uniwesalna 2,5/5 mm pod haki dachowe (100 szt)"},{"$f":"B34","v":"Wkręty do drewna VA8x120mm 50St"},{"$f":"B35","v":"Zaślepka plastikowa Profi05 20St."},{"$f":"B38","v":"Zacisk odgromowy  8 i 10mm"},"Zestaw mocujący do pokryć falistych 10 x 200","Nasadka KlickTop"]
[null,"Rząd 1",{"$f":"Dachówka_blachodachówka!G24","v":8},{"$f":"IF(Dachówka!$C5>0,((C5-1)*2),0)","v":14},{"$f":"IF(Dachówka!$C5>0,4,0)","v":4},{"$f":"(CEILING(((Dachówka!$C5*$F$2)/4.3),1))*2","v":6},{"$f":"(IF((Dachówka!$F5>2),((CEILING((Dachówka!$C5*$F$2/4.2),1))-1),0))*2","v":4},{"$f":"IF(C5=0,0,ROUNDUP((C5/($C$2/100)+1),0)*2)","v":4},{"$f":"+H5*4","v":16},{"$f":"+H5*2","v":8},{"$f":"+E5","v":4},{"$f":"IF(Dachówka!$C5>0,2,0)","v":2},{"$f":"IF(C5=0,0,ROUNDUP((C5/($C$2/100)+1),0)*2)","v":4},{"$f":"M5","v":4}]
[null,"Rząd 2",{"$f":"Dachówka_blachodachówka!G25","v":6},{"$f":"IF(Dachówka!$C6>0,((C6-1)*2),0)","v":10},{"$f":"IF(Dachówka!$C6>0,4,0)","v":4},{"$f":"(CEILING(((Dachówka!$C6*$F$2)/4.3),1))*2","v":4},{"$f":"(IF((Dachówka!$F6>2),((CEILING((Dachówka!$C6*$F$2/4.2),1))-1),0))*2","v":2},{"$f":"IF(C6=0,0,ROUNDUP((C6/($C$2/100)+1),0)*2)","v":4},{"$f":"+H6*4","v":16},8,4,{"$f":"IF(Dachówka!$C6>0,2,0)","v":2},{"$f":"IF(C6=0,0,ROUNDUP((C6/($C$2/100)+1),0)*2)","v":4},4]
[null,"Rząd 3",{"$f":"Dachówka_blachodachówka!G26","v":0},{"$f":"IF(Dachówka!$C7>0,((C7-1)*2),0)","v":0},{"$f":"IF(Dachówka!$C7>0,4,0)","v":0},{"$f":"(CEILING(((Dachówka!$C7*$F$2)/4.3),1))*2","v":0},{"$f":"(IF((Dachówka!$F7>2),((CEILING((Dachówka!$C7*$F$2/4.2),1))-1),0))*2","v":0},0,0,0,0,{"$f":"IF(Dachówka!$C7>0,2,0)","v":0},0,0]
[null,"Rząd 4",{"$f":"Dachówka_blachodachówka!G27","v":5},{"$f":"IF(Dachówka!$C8>0,((C8-1)*2),0)","v":8},{"$f":"IF(Dachówka!$C8>0,4,0)","v":4},{"$f":"(CEILING(((Dachówka!$C8*$F$2)/4.3),1))*2","v":4},{"$f":"(IF((Dachówka!$F8>2),((CEILING((Dachówka!$C8*$F$2/4.2),1))-1),0))*2","v":2},4,16,8,4,{"$f":"IF(Dachówka!$C8>0,2,0)","v":2},4,4]
[null,"Rząd 5",{"$f":"Dachówka_blachodachówka!G28","v":5},{"$f":"IF(Dachówka!$C9>0,((C9-1)*2),0)","v":8},{"$f":"IF(Dachówka!$C9>0,4,0)","v":4},{"$f":"(CEILING(((Dachówka!$C9*$F$2)/4.3),1))*2","v":4},{"$f":"(IF((Dachówka!$F9>2),((CEILING((Dachówka!$C9*$F$2/4.2),1))-1),0))*2","v":2},4,16,8,4,{"$f":"IF(Dachówka!$C9>0,2,0)","v":2},4,4]
[null,"Rząd 6",{"$f":"Dachówka_blachodachówka!G29","v":5},{"$f":"IF(Dachówka!$C10>0,((C10-1)*2),0)","v":8},{"$f":"IF(Dachówka!$C10>0,4,0)","v":4},{"$f":"(CEILING(((Dachówka!$C10*$F$2)/4.3),1))*2","v":4},{"$f":"(IF((Dachówka!$F10>2),((CEILING((Dachówka!$C10*$F$2/4.2),1))-1),0))*2","v":2},4,16,8,4,{"$f":"IF(Dachówka!$C10>0,2,0)","v":2},4,4]
[null,"Rząd 7",{"$f":"Dachówka_blachodachówka!G30","v":0},{"$f":"IF(Dachówka!$C11>0,((C11-1)*2),0)","v":0},{"$f":"IF(Dachówka!$C11>0,4,0)","v":0},{"$f":"(CEILING(((Dachówka!$C11*$F$2)/4.3),1))*2","v":0},{"$f":"(IF((Dachówka!$F11>2),((CEILING((Dachówka!$C11*$F$2/4.2),1))-1),0))*2","v":0},0,0,0,0,{"$f":"IF(Dachówka!$C11>0,2,0)","v":0},0,0]
[null,"Rząd 8",{"$f":"Dachówka_blachodachówka!G31","v":0},{"$f":"IF(Dachówka!$C12>0,((C12-1)*2),0)","v":0},{"$f":"IF(Dachówka!$C12>0,4,0)","v":0},{"$f":"(CEILING(((Dachówka!$C12*$F$2)/4.3),1))*2","v":0},{"$f":"(IF((Dachówka!$F12>2),((CEILING((Dachówka!$C12*$F$2/4.2),1))-1),0))*2","v":0},0,0,0,0,{"$f":"IF(Dachówka!$C12>0,2,0)","v":0},0,0]
[null,"Rząd 9",{"$f":"Dachówka_blachodachówka!G32","v":0},{"$f":"IF(Dachówka!$C13>0,((C13-1)*2),0)","v":0},{"$f":"IF(Dachówka!$C13>0,4,0)","v":0},{"$f":"(CEILING(((Dachówka!$C13*$F$2)/4.3),1))*2","v":0},{"$f":"(IF((Dachówka!$F13>2),((CEILING((Dachówka!$C13*$F$2/4.2),1))-1),0))*2","v":0},0,0,0,0,{"$f":"IF(Dachówka!$C13>0,2,0)","v":0},0,0]
[null,"Rząd 10",{"$f":"Dachówka_blachodachówka!G33","v":0},{"$f":"IF(Dachówka!$C14>0,((C14-1)*2),0)","v":0},{"$f":"IF(Dachówka!$C14>0,4,0)","v":0},{"$f":"(CEILING(((Dachówka!$C14*$F$2)/4.3),1))*2","v":0},{"$f":"(IF((Dachówka!$F14>2),((CEILING((Dachówka!$C14*$F$2/4.2),1))-1),0))*2","v":0},0,0,0,0,{"$f":"IF(Dachówka!$C14>0,2,0)","v":0},0,0]
[null,"Rząd 11",{"$f":"Dachówka_blachodachówka!G34","v":0},{"$f":"IF(Dachówka!$C15>0,((C15-1)*2),0)","v":0},{"$f":"IF(Dachówka!$C15>0,4,0)","v":0},{"$f":"(CEILING(((Dachówka!$C15*$F$2)/4.3),1))*2","v":0},{"$f":"(IF((Dachówka!$F15>2),((CEILING((Dachówka!$C15*$F$2/4.2),1))-1),0))*2","v":0},0,0,0,0,{"$f":"IF(Dachówka!$C15>0,2,0)","v":0},0,0]
{"$rows_left_out":39}
{"sheet":"Blachodachowka","index":5,"n_rows":46,"n_cols":13,"rows_kept":46,"hidden":true}
[]
[null,"Rozstaw krokwii:",{"$f":"Dachówka_blachodachówka!I17","v":805},"cm","Szerokość PV",{"$f":"Dachówka!F2","v":1.153},"m"]
[]
[null,"Rzędy","Ilość modułów ","Klemy środkowe ","Klemy końcowe",{"$f":"Dachówka!F4","v":"Profil nośny modułu Solo light 4,4m"},{"$f":"Cennik!F52","v":"Łącznik profili Solo5 "},"Hak dachowy Rapid 2+ 45","Wkręt do drewna (50 szt.)  ","Kołpak końcowy (20szt.)",{"$f":"B37","v":"Zacisk odgromowy  8 i 10mm"},"Zestaw mocujący do pokryć falistych 10 x 200","Nasadka KlickTop"]
[null,"Rząd 1",{"$f":"Dachówka_blachodachówka!G24","v":8},{"$f":"IF(Dachówka!$C5>0,((C5-1)*2),0)","v":14},{"$f":"IF(Dachówka!$C5>0,4,0)","v":4},{"$f":"(CEILING(((Dachówka!$C5*$F$2)/4.2),1))*2","v":6},{"$f":"(IF((Dachówka!$F5>2),((CEILING((Dachówka!$C5*$F$2/4.2),1))-1),0))*2","v":4},{"$f":"IF(C5=0,0,ROUNDUP((C5/($C$2/100)+1),0)*2)","v":4},{"$f":"+H5*2","v":8},{"$f":"+E5","v":4},{"$f":"IF(Dachówka!$C5>0,2,0)","v":2},{"$f":"IF(C5=0,0,ROUNDUP((C5/($C$2/100)+1),0)*2)","v":4},{"$f":"L5","v":4}]
[null,"Rząd 2",{"$f":"Dachówka_blachodachówka!G25","v":6},{"$f":"IF(Dachówka!$C6>0,((C6-1)*2),0)","v":10},{"$f":"IF(Dachówka!$C6>0,4,0)","v":4},{"$f":"(CEILING(((Dachówka!$C6*$F$2)/4.2),1))*2","v":4},{"$f":"(IF((Dachówka!$F6>2),((CEILING((Dachówka!$C6*$F$2/4.2),1))-1),0))*2","v":2},{"$f":"IF(C6=0,0,ROUNDUP((C6/($C$2/100)+1),0)*2)","v":4},8,4,{"$f":"IF(Dachówka!$C6>0,2,0)","v":2},{"$f":"IF(C6=0,0,ROUNDUP((C6/($C$2/100)+1),0)*2)","v":4},4]
[null,"Rząd 3",{"$f":"Dachówka_blachodachówka!G26","v":0},{"$f":"IF(Dachówka!$C7>0,((C7-1)*2),0)","v":0},{"$f":"IF(Dachówka!$C7>0,4,0)","v":0},{"$f":"(CEILING(((Dachówka!$C7*$F$2)/4.2),1))*2","v":0},{"$f":"(IF((Dachówka!$F7>2),((CEILING((Dachówka!$C7*$F$2/4.2),1))-1),0))*2","v":0},0,0,0,{"$f":"IF(Dachówka!$C7>0,2,0)","v":0},0,0]
[null,"Rząd 4",{"$f":"Dachówka_blachodachówka!G27","v":5},{"$f":"IF(Dachówka!$C8>0,((C8-1)*2),0)","v":8},{"$f":"IF(Dachówka!$C8>0,4,0)","v":4},{"$f":"(CEILING(((Dachówka!$C8*$F$2)/4.2),1))*2","v":4},{"$f":"(IF((Dachówka!$F8>2),((CEILING((Dachówka!$C8*$F$2/4.2),1))-1),0))*2","v":2},4,8,4,{"$f":"IF(Dachówka!$C8>0,2,0)","v":2},4,4]
[null,"Rząd 5",{"$f":"Dachówka_blachodachówka!G28","v":5},{"$f":"IF(Dachówka!$C9>0,((C9-1)*2),0)","v":8},{"$f":"IF(Dachówka!$C9>0,4,0)","v":4},{"$f":"(CEILING(((Dachówka!$C9*$F$2)/4.2),1))*2","v":4},{"$f":"(IF((Dachówka!$F9>2),((CEILING((Dachówka!$C9*$F$2/4.2),1))-1),0))*2","v":2},4,8,4,{"$f":"IF(Dachówka!$C9>0,2,0)","v":2},4,4]
[null,"Rząd 6",{"$f":"Dachówka_blachodachówka!G29","v":5},{"$f":"IF(Dachówka!$C10>0,((C10-1)*2),0)","v":8},{"$f":"IF(Dachówka!$C10>0,4,0)","v":4},{"$f":"(CEILING(((Dachówka!$C10*$F$2)/4.2),1))*2","v":4},{"$f":"(IF((Dachówka!$F10>2),((CEILING((Dachówka!$C10*$F$2/4.2),1))-1),0))*2","v":2},4,8,4,{"$f":"IF(Dachówka!$C10>0,2,0)","v":2},4,4]
[null,"Rząd 7",{"$f":"Dachówka_blachodachówka!G30","v":0},{"$f":"IF(Dachówka!$C11>0,((C11-1)*2),0)","v":0},{"$f":"IF(Dachówka!$C11>0,4,0)","v":0},{"$f":"(CEILING(((Dachówka!$C11*$F$2)/4.2),1))*2","v":0},{"$f":"(IF((Dachówka!$F11>2),((CEILING((Dachówka!$C11*$F$2/4.2),1))-1),0))*2","v":0},0,0,0,{"$f":"IF(Dachówka!$C11>0,2,0)","v":0},0,0]
[null,"Rząd 8",{"$f":"Dachówka_blachodachówka!G31","v":0},{"$f":"IF(Dachówka!$C12>0,((C12-1)*2),0)","v":0},{"$f":"IF(Dachówka!$C12>0,4,0)","v":0},{"$f":"(CEILING(((Dachówka!$C12*$F$2)/4.2),1))*2","v":0},{"$f":"(IF((Dachówka!$F12>2),((CEILING((Dachówka!$C12*$F$2/4.2),1))-1),0))*2","v":0},0,0,0,{"$f":"IF(Dachówka!$C12>0,2,0)","v":0},0,0]
[null,"Rząd 9",{"$f":"Dachówka_blachodachówka!G32","v":0},{"$f":"IF(Dachówka!$C13>0,((C13-1)*2),0)","v":0},{"$f":"IF(Dachówka!$C13>0,4,0)","v":0},{"$f":"(CEILING(((Dachówka!$C13*$F$2)/4.2),1))*2","v":0},{"$f":"(IF((Dachówka!$F13>2),((CEILING((Dachówka!$C13*$F$2/4.2),1))-1),0))*2","v":0},0,0,0,{"$f":"IF(Dachówka!$C13>0,2,0)","v":0},0,0]
[null,"Rząd 10",{"$f":"Dachówka_blachodachówka!G33","v":0},{"$f":"IF(Dachówka!$C14>0,((C14-1)*2),0)","v":0},{"$f":"IF(Dachówka!$C14>0,4,0)","v":0},{"$f":"(CEILING(((Dachówka!$C14*$F$2)/4.2),1))*2","v":0},{"$f":"(IF((Dachówka!$F14>2),((CEILING((Dachówka!$C14*$F$2/4.2),1))-1),0))*2","v":0},0,0,0,{"$f":"IF(Dachówka!$C14>0,2,0)","v":0},0,0]
[null,"Rząd 11",{"$f":"Dachówka_blachodachówka!G34","v":0},{"$f":"IF(Dachówka!$C15>0,((C15-1)*2),0)","v":0},{"$f":"IF(Dachówka!$C15>0,4,0)","v":0},{"$f":"(CEILING(((Dachówka!$C15*$F$2)/4.2),1))*2","v":0},{"$f":"(IF((Dachówka!$F15>2),((CEILING((Dachówka!$C15*$F$2/4.2),1))-1),0))*2","v":0},0,0,0,{"$f":"IF(Dachówka!$C15>0,2,0)","v":0},0,0]
{"$rows_left_out":32}
{"sheet":"Cennik","index":6,"n_rows":59,"n_cols":15,"rows_kept":59}
[]
[]
[]
[{"$nulls":5},"Nazwa","Nr zam.","Cena katalogowa","Moc [W]","Szerokość ","Wysokość"]
[{"$nulls":5},"Vitovolt 300 M405 WE Blackframe",7998593,{"v":789,"d":"789.00 zł"},405,{"v":1.14,"d":"1.140"},1.719]
[{"$nulls":5},"Vitovolt 300 M405 AK Standard",7959744,{"v":700,"d":"700.00 zł"},405,1.133,1.708]
[{"$nulls":5},"Moduł PV VSE 375 black frame",7719816,{"v":500,"d":"500.00 zł"},375,1.038,1.755]
[{"$nulls":5},"Vitovolt 300 M340 WA black frame",7731047,{"v":518,"d":"518.00 zł"},340,1.068,1.622]
[{"$nulls":10},"  "]
[{"$nulls":5},"Nazwa","Nr zam.","Cena katalogowa ","Moc [kW]"]
[{"$nulls":5},"***FRONIUS***"]
[{"$nulls":5},"Inwerter Symo 3.0-3-M",7202628,{"v":5730,"d":"5,730.00 zł"},3]
[{"$nulls":5},"Inwerter Symo 3.7-3-M",7202629,{"v":6288,"d":"6,288.00 zł"},3.7,{"$nulls":3},7202628,"Inwerter Symo 3.0-3-M",4500]
[{"$nulls":5},"Inwerter Symo 17.5-3-M",7202638,{"v":11889,"d":"11,889.00 zł"},17.5,{"$nulls":3},7202637,"Inwerter Symo 15.0-3-M",9750]
[{"$nulls":5},"Inwerter Symo 20.0-3-M",7202639,{"v":12575,"d":"12,575.00 zł"},20,{"$nulls":3},7202638,"Inwerter Symo 17.5-3-M",10500]
{"$rows_left_out":44}